Check Tests Error 1

RECOMMENDED: If you have Windows errors then we strongly recommend that you download and run this (Windows) Repair Tool.

Error in make check Please help. – GMP – Jun 11, 2015. check command i get the following error log: make check-recursive make[1]: Entering directory '/sources/gmp-6.0.0' Making check in tests.

DisconnectedContext error when running Unit Tests in. – I have this problem with running unit tests in VS2015 Enterprise. Whenever I run any unit test in debug mode, I get the following error: Managed Debugging Assistant.

make[5]: *** [test-suite.log] Error 1 make[5]: Leaving directory `/mnt/tmp/gmp/gmp- 6.1.0/tests/cxx' make[4]: *** [check-TESTS] Error 2 make[4]:.

Oct 16, 2016. 'check-TESTS' failed make[4]: *** [check-TESTS] Error 1 make[4]: Leaving directory '/home/pi/src/gmp-5.0.2/tests/mpz' Makefile:1149: recipe.

load test – Formula 1 teams can finalise the specification of their 2018 chassis after the FIA confirmed details of how the new Halo cockpit protection device load test will be.

How To Fix Error Code 67 Registration Failure How to Fix Sprint Error Code 67 Registration Failure Errors Windows operating system misconfiguration is the main cause of Sprint Error Code 67 Registration If the car registration number logged does not match that seen by a parking warden on the number plate they will assume the motorist has not

Nov 10, 2009. `/home/rajeev/gmp-4.3.1/tests' > /usr/local/bin/make check-TESTS. make[4]: *** [check-TESTS] Error 1 > make[4]: Leaving directory.

This freaking Cyclical Redundancy Check Error was freaking me out. Here’s how I fixed the problems with Cyclical Redundancy Check error for my Iomega External Hard Drive.

Error 6177 Quickbooks Introduction of QuickBooks Error code c=6177 QuickBooks QuickBooks Error code c=47caused by Internet Explorer settings for secured web sites. To resolve this error you have to configure the SSL settings of internet explorer in. Contact QuickBooks Technical Support Phone Number 800-760-5113 for QuickBooks support. Our Live Quickbooks Technical Support offer

Request Apology for NSF Check due to Error Template – Download Now. Simply fill-in the blanks and print in minutes! Instant Access to 1,800+ business and legal forms.

Checking a blog. Testing a site's usability. General website and HTML checks. CSS Compressor – Although this service cannot check for errors, it is a great tool to use after your CSS code has been verified.

This is the first practical test in a commercial network after ZTE’s Pre5G TDD.

Evans, 27, failed a doping test at the Barcelona Open this year and his ban has.

Att Error 678 Later, it asserted a revised, but error filled theory. Lastly. the Federal Circuit reversed a finding of willfulness based on an ANDA filing and held: “[T]he mere fact that a company has filed an ANDA application or [paragraph IV] certification. Kinetic Modeling of the Polychloroprene Pyrolysis Under. – In the

Feb 4, 2014. The system is (result of uname -a) Linux cluster 2.4.21-32.0.1.ELsmp #1 SMP. make[4]: *** [check-TESTS] Error 1 make[4]: Leaving directory.

Data Checking – Test 1. These tests present you with number of tables of information which must be checked against each other. This type of test is used to measure how quickly and accurately errors can be detected in data.

Feb 11, 2016. Hello, That is a bit peculiar, can you provide the `test-suite.log` file. target 'check -recursive' failed > make: *** [check-recursive] Error 1 > > The.

error free?

Do You Have Math Anxiety? A Self Test. Rate your answers from 1 to 5; add them up and check your score below. (1) = Disagree, (5) = Agree. I cringe when I have to go.

SINGAPORE – Some 190 people received a "not at risk" result after trying out a new diabetes risk assessment test online – but their relief turned out to be short-lived. The result was actually wrong. It was caused by a software error in the.

RECOMMENDED: Click here to fix Windows errors and improve system performance