Error C2082

Colegio Monteolivo OK

RECOMMENDED: If you have Windows errors then we strongly recommend that you download and run this (Windows) Repair Tool.

Re: [Wireshark-dev] error encountered during compilation on windows – Feb 11, 2014. epanexcept.h(97) : error C2054: expected '(' to follow 'WS_MSVC_NORETURN'. epanexcept.h(97) : error C2085: 'except_rethrow' : not in formal parameter list. epanexcept.h(98) : error C2082: redefinition of formal parameter ' WS_MSVC_NORETURN'. epanexcept.h(98) : error C2143: syntax error.

PUBLIC NOTICE Road Traffic Regulation Act 1984 – Alternative route: U0402 CookseyGreen Lane, C2084 BerryLane, C2083 BerryLane, C2081 Crutch Lane, C2085 Crown Lane, C2082 Elmbridge Lane, C2018 Clattercut Lane, C2147 Purshull Green Lane and vice versa. (a) from the junction.

Error C2082: Redefinition Of Formal Parameter 'price' – C And. – Here the compiler's pretty much told you what's wrong, and should give you a line number which will direct you to the problem. In the parameter list of the function.

A formal parameter to a function is redeclared within the function body. void func(int a) { int a; // C2082 }

Post Error 220-runtime Cache Accelerator Failure Error Event 14 Aug 2, 2010. Event ID 4107 CAPI2 Windows 7 Error How to fix. to solve it?. event+. of 4,107 feet and was fracture stimulated with 14 stages. System Center 2012 R2 Configuration Manager – Error. – Symptom: Inside of Event Viewer, you see the following Error entry.
Error Event 14 Aug 2, 2010. Event ID 4107 CAPI2 Windows 7 Error How to fix. to solve it?. event+. of 4,107 feet and was fracture stimulated with 14 stages. System Center 2012 R2 Configuration Manager – Error. – Symptom: Inside of Event Viewer, you see the following Error entry. On 06/27/14 07:29:39,

error C2082: 仮パラメーター 'name' が再定義されました。とでます。 まだ初心者なので よくわからないのですが、どうやったら解決するでしょうか。 ご回答よろしくお願いします。 補足ご回答ありがとうございます。できれば解決方法もよろしくお願いしますm(_ _)m あとchar[50] nameは誤字です。char name[50]です。 この質問.

Feb 9, 2014. I'm new here, sorry if I'm doing this wrong. I keep getting two errors when I try to compile: functions.cpp(126): error C2082: redefinition of formal parameter 'dive' and functions.cpp(127): error C2082: redefinition of formal parameter 'difficulty' I don't know what is wrong and I'm new at c++ so I'm asking for.

Internet Explorer Error Dns Error Event 14 Aug 2, 2010. Event ID 4107 CAPI2 Windows 7 Error How to fix. to solve it?. event+. of 4,107 feet and was fracture stimulated with 14 stages. System Center 2012 R2 Configuration Manager – Error. – Symptom: Inside of Event Viewer, you see the following Error entry.

Alternative route: C2084 Swan Lane, A38 Worcester Road, A38 Motorway junction, A38 Rashwood Hill, Ford Lane, C2082 Crutch Lane, C2083 Crutch Lane, C2083 Berry Lane, C2084 Swan Lane and vice versa. Maximum duration: 18 Months.

Scenario is I have a function which calls parameterized constructor when I want to initialize. So what I want to do is to call constructor of my choice when I want.

Apr 25, 2014. In your member function i you're trying to call the c'tor of A like this: void i(int tmp) { A(tmp); }. In fact A(tmp) declares a variable tmp of type A. Since tmp is already declared as int inside the same scope, the compiler complains. If you want a variable of type A and initialize it via the A::A(int) c'tor then you need.

The new home for Visual Studio documentation is Visual Studio 2017 Documentation on docs.microsoft.com. The latest version of this topic can be found at Compiler.

Free source code and tutorials for Software developers and Architects.; Updated: 7 Dec 2013

View and Download Sony STR-DA4400ES service manual online. MULTI CHANNEL AV RECEIVER. STR-DA4400ES Receiver pdf manual download.

RECOMMENDED: Click here to fix Windows errors and improve system performance