Xpra_execution Error Tp_step_failure

RECOMMENDED: If you have Windows errors then we strongly recommend that you download and run this (Windows) Repair Tool.

There Was An Error Accessing Your System Registry Outlook 2010 Computer error. registry!). Speaking of filesystems, why is it that a SQL database can find a specific record in a database of millions of records in a fraction of a second, but finding a specific file on your hard drive takes minutes?. Error 8452 The Naming Context In a second
Returned I/o Error 0x0/0x2 When NotifyStableUnicastIpAddressTable returns ERROR_IO_PENDING, which indicates that the I/O request is pending, the stable unicast IP address table is returned to the function in the CallerCallback parameter. A pointer to the. You accomplish this by minimizing disk i/o, especially disk writes down to the bare minimum. so… SELECT * FROM

When Upgrading Basis Support Pack level from 09 to 10 in EHP7, RDDEXECL Job is getting cancelled becasue internal session terminated due to syntax error. screenshot.

The import was stopped since an error occurred during the phase XPRA_EXECUTION, XPRA_Execution: Error during support. Execution Reason for error: TP_STEP_FAILURE

Error Detection And Correction Using Hamming Codes The modern development of error-correcting codes in 1947 is due to Richard W. Hamming. A description of. Every block of data received is checked using the error detection code used, and if the check fails, retransmission of the data is requested – this may be done repeatedly, until the data

Importing a Support Package for BPC NetWeaver 10.1 fails with a XPRA_EXECUTION error. 1- SPAM transaction shows : Error in phase XPRA_EXECUTION Reason for error.

Jan 16, 2005. Error in phase: XPRA_EXECUTION – Reason for error: TP_STEP_FAILURE – Return code: 0014 – Error message: OCS Package SAPKE46C77 , tp step I, return code 0014. Notes on phase XPRA_EXECUTION The XPRAs and after- import methods are executed in this phase. This phase can terminate due.

. 1 fails with a XPRA_EXECUTION error. 1- SPAM transaction shows : Error in phase XPRA_EXECUTION Reason for error : TP_STEP_FAILURE. 2246880 – Error occurred in.

Error during XPRA EXECUTION phase of SAINT during Delta Upgrade of BI CONT to. XPRA_EXECUTION – Reason for error: TP_STEP. TP_STEP_FAILURE in the phase DDIC.

Dear experts,While applying SAPKB70105 it shows error.The import was stopped, since an error occurred during the phase XPRA_EXECUTION, which the Support Package.

May 4, 2010. hi all, i encountered an error during my ABAP SP Level upgrade. my system&#39 ;s current level is SP16 and i am upgrading it to.

Nov 29, 2011. Error in phase: XPRA_EXECUTION – Reason for error: TP_STEP_FAILURE – Return code: 0008 – Error message: OCS Package SAPK-705DZINBICONT, tp step "R", return code 0008. Important Information SAP Kernel Stack Level 310 ( latest available) SPAM/SAINT version 700/44 (latest available ).

Dear Gurus, I am facing Problem when i apply SAP_BW 731 Patches SP001 it is stuck at XPRA_EXECUTION.SPAM is up to date, SAP_BASIS, SAP_ABA, PI_BASIS, ST_PI up.

Hi All,I try to Install BI-Content 3.53 Support Packages SAPKIBIFP1 to SAPKIBIFP5 When iam Importing SAPKIBIFP2 I have follow Error Message.

Aug 1, 2011. Hi, I'm trying to import Solution Manager SPS 27 from SPS 25 and I get an error on SAINT: In the Import 2: – Error in phase: XPRA_EXECUTION – Reason for error : TP_STEP_FAILURE – Return code: 0008 – Error message: OCS Package SAPK- 706BZINBICONT, tp step "R", return code 0008. Transport logs.

Error in phase: XPRA_EXECUTION – Toolbox for IT Groups – Jun 16, 2009. Hi, When I imported SAPKB62043 in TxSPAM I received the following error message: "Error in phase: XPRA_EXECUTION Reason for error: TP_STEP_FAILURE Return code: 0012. Error message: OCS Package SAPKB62043, tp step R, return code 0012 " In the import logs have also found the following.

Phase Xpra_Execution TP_STEP_FAILURE tp return code 12 error – Hi All,I try to Install BI-Content 3.53 Support Packages SAPKIBIFP1 to SAPKIBIFP5 When iam Importing SAPKIBIFP2 I have follow Error Message.

Nov 1, 2009. While updating the spam version to 36 in crm 700, its throughing the below message. I checked tp tool, consistency check, everything seems fine. any idea what may casue this problem, as my spam is struck in import_proper phase of Prologue. The installation was stopped, since an error occurred during.

RECOMMENDED: Click here to fix Windows errors and improve system performance