Error C6001 Temporary Register Limit Of 12 Exceeded

RECOMMENDED: If you have Windows errors then we strongly recommend that you download and run this (Windows) Repair Tool.

More official figures will be revealed towards the middle of the month, but even accounting for the margin of error of.

Svchost Error In W2k Sep 23, 2013  · Accidentally ran a.scr file, what has it done? – posted in Virus, Trojan, Spyware, and Malware Removal Logs: Yesterday, I wasnt paying attention and launched a. PC Hell: How to Fix SVCHOST.EXE Application Error – I came across this error the other day at a customer's house.
Error Code 305 Emfi 1 Error Code 12505 In Oracle. Top Best Answer 0 Mark this reply as the best answer?(Choose carefully, this can't be changed) Yes | No Saving. Error=(code=305)(emfi=1) The time now is 15:28. Do you think that caused the problems ? How To Repair Error_stack Error Code 12505 Emfi 4 Tutorial –

Unfortunately, when I made these alterations, I received the error message: " Temporary register limit of 32 exceeded; 57 registers needed to.

Cg in program 'frag': error C6001: Temporary register limit of 12 exceeded; 13 registers needed to compile program at line 30 (Filename: Line: 30). I have a limit of 12! Any hints about what's going wrong?

(0) : error C6001: Temporary register limit of 32 exceeded; 69 registers needed to compile program. I don't have that many temporary variables, so I think the cause for this is automatic loop unrolling in the CG compiler.

Index Is Out Of Date Error Sep 13, 2014. Can't log onto server because it is out of date. You need to downgrade, we won' t update to 1.8 until all plugins and bukkit are up to date, If you are using the BDE you may have experienced these problems, 'Index Out Of Date' or 'Blob

TRUMP: "The Iranian regime has committed multiple violations of the agreement. For example, on two separate occasions, they have exceeded the limit of 130 metric tons of heavy water." THE FACTS: Iran is meeting all of its.

If the project�s cost of capital (discount rate) is 12.5.

Wed Feb 04 20:27:12. error C6001: Temporary register limit of 32 exceeded;. Temporary register limit of 32 exceeded;.

(screenPosition.x<=_cliprect[2])&& (screenPosition.y>=_cliprect[1])&& ( screenPosition.y<=_cliprect[3])){ Now it gives me the error "Not enough.

A 421 email error is typically a temporary routing issue on the receiving mail server’s. Email Error 421;. Is there a limit to how many "connections" I can have?

We are pleased to send you the November edition of "Government Contracts Legislative and Regulatory Update," which offers a. DoD Component that the revocation was in error. If the DoD does not lift the temporary revocation.

EX 06-12 – Upgrade of existing GE Medical Systems MRI to Excite HD 1.5T.

Access denied – If you are not registered on the site, you will be prompted to complete the registration process.

Event ID codes – technet.microsoft.com – May 13, 2010  · Event ID codes Applies to:. Error. Exceeded the maximum process events limit. 1016. Initialization/ Termination. Error. Failed to register or enable the.

Mar 13, 2008  · . error C6001: Temporary register limit of 12 exceeded;. I got it working (it was my fault) and it exceeded my exceptions on ease of.

The sheriff says 45 people injured in the massacre Oct. 1 remain hospitalized in critical condition. 12:20 a.m. Nearly two weeks after the Las Vegas mass shooting, authorities have yet to sort out the basic facts. Las Vegas police are.

In other words, we got weak inspections in exchange for no more than a purely short-term and temporary delay in Iran’s path. For example, on two separate occasions, they have exceeded the limit of 130 metric tons of heavy water.

Related errors: // error C5013: profile does not support "for". However, it may fail : // error C6001: Temporary register limit of 32 exceeded; 35 registers. //#define PHOSPHOR_BLOOM_TRIADS_LARGER_THAN_12_PIXELS.

I’m trying the demo, & ran into a problem. I don’t like to skip any of the puzzles, but sometimes want to back out of it to look around, & continue later. In every.

Jan 11, 2015  · . found a solution to run the games flawless with psx2psp. // error C6001: Temporary register limit of 32. Instruction limit of 1024 exceeded:.

Solved: Temporary sort space limit exceeded – Micro Focus SW. – Feb 23, 2016. Solved: HI, when I run a 3month period report in Arcsight 6.5 I got this error: netsoft.sree.RepletException: Failed to create report:

Global Page Error. c:\inetpub\wwwroot\autovin.am\Views\Report\InvalidKey.cshtml(6): error CS0103: The name 'Texts' does not exist in the current context.

Jan 9, 2015. Related errors: // error C5013: profile does not support "for". However, it may fail : // error C6001: Temporary register limit of 32 exceeded; 35 registers. #define PHOSPHOR_BLOOM_TRIADS_LARGER_THAN_12_PIXELS.

RECOMMENDED: Click here to fix Windows errors and improve system performance